{"text_format":"1","workbook":"xlsx","n_sheets":27,"sheets":["Integración_PAA","Plan_de_Acción_Anual","PINAR","Plan_de_Vacantes","Plan_de_Previsión","PETH","PIC","Plan_de_Incentivos","PSST","PAAC","PAAC_Riesgos","PAAC_Trámites","PAAC_Rendición_de_Cuentas","PAAC_Atención_al_Ciudadano","PAAC_Transparencia","Otras Iniciativas","Anexo 1 Ide y Ana Riesgos","PETI","Tratamiento_de_riesgos","Seguridad_de_Información","Riesgos","Trámites","Rendición_de_Cuentas","Transparencia","Atención_al_Ciudadano","Otras","Proyectos de Inversión BPIN"],"not_rendered":{"charts":0,"images":10,"macros":1,"external_links":5,"defined_names":37,"comments":0,"pivot_tables":0},"unopened":[],"bounds":{"document_bytes":16777216,"sheet_cells":100000,"rows_first":2000,"rows_last":500,"rows_between":2000,"halvings":0,"cell_chars":16384,"cell_head_chars":4096},"cells_cut":0,"cells_raw":0,"read":"whole","date_system":"1900"}

{"sheet":"Integración_PAA","index":0,"n_rows":67,"n_cols":11,"rows_kept":67,"cut":false,"hidden":false,"merged":[[53,12,53,14],[65,10,65,14],[66,10,71,14]]}
[]
[]
[]
[]
[]
[]
{"$rows_left_out":62}
{"sheet":"Plan_de_Acción_Anual","index":1,"n_rows":30,"n_cols":18,"rows_kept":30,"cut":false,"hidden":false,"merged":[[1,1,11,17]]}
[]
[null,"PLAN DE ACCIÓN ANUAL 2020"]
[]
[]
[]
[]
{"$rows_left_out":25}
{"sheet":"PINAR","index":2,"n_rows":17,"n_cols":11,"rows_kept":17,"cut":false,"hidden":false,"merged":[[1,3,11,8]]}
[]
[null,null,null,"PLAN INSTITUCIONAL DE ARCHIVOS - PINAR"]
[]
[]
[]
[]
{"$rows_left_out":12}
{"sheet":"Plan_de_Vacantes","index":3,"n_rows":19,"n_cols":11,"rows_kept":19,"cut":false,"hidden":false,"merged":[[1,2,11,10],[15,1,18,1]]}
[]
[null,null,"PLAN ANUAL DE VACANTES 2020"]
[]
[]
[]
[]
{"$rows_left_out":14}
{"sheet":"Plan_de_Previsión","index":4,"n_rows":17,"n_cols":11,"rows_kept":17,"cut":false,"hidden":false,"merged":[[1,4,11,7],[15,1,16,1]]}
[]
[null,null,null,null,"PLAN ANUAL DE PREVISIÓN DE RECURSOS HUMANOS 2020"]
[]
[]
[]
[]
{"$rows_left_out":12}
{"sheet":"PETH","index":5,"n_rows":0,"n_cols":0,"rows_kept":0,"cut":false,"hidden":false,"merged":[[40,2,40,21]]}

{"sheet":"PIC","index":6,"n_rows":20,"n_cols":11,"rows_kept":20,"cut":false,"hidden":false,"merged":[[1,4,11,8],[17,1,19,1]]}
[]
[null,null,null,null,"PLAN INSTITUCIONAL DE CAPACITACIÓN\nPIC 2020"]
[]
[]
[]
[]
{"$rows_left_out":15}
{"sheet":"Plan_de_Incentivos","index":7,"n_rows":21,"n_cols":11,"rows_kept":21,"cut":false,"hidden":false,"merged":[[1,4,11,8],[17,1,20,1]]}
[]
[null,null,null,null,"PLAN DE BIENESTAR E INCENTIVOS\nINSTITUCIONALES 2020"]
[]
[]
[]
[]
{"$rows_left_out":16}
{"sheet":"PSST","index":8,"n_rows":25,"n_cols":11,"rows_kept":25,"cut":false,"hidden":false,"merged":[[1,4,11,8],[17,1,24,1]]}
[]
[null,null,null,null,"PLAN DE TRABAJO ANUAL EN SEGURIDAD Y SALUD \nEN EL TRABAJO - PSST 2020"]
[]
[]
[]
[]
{"$rows_left_out":20}
{"sheet":"PAAC","index":9,"n_rows":38,"n_cols":6,"rows_kept":38,"cut":false,"hidden":false,"merged":[[37,5,37,8]]}
[" "]
[]
[]
[]
[]
[]
{"$rows_left_out":33}
{"sheet":"PAAC_Riesgos","index":10,"n_rows":20,"n_cols":18,"rows_kept":20,"cut":false,"hidden":false,"merged":[[7,1,19,1],[7,2,19,2],[7,3,8,3],[7,4,8,4],[7,5,8,5],[12,4,13,4],[12,5,13,5],[14,3,16,3],[14,4,16,4],[14,5,16,5],[7,17,19,17],[9,3,11,3],[9,4,11,4],[9,5,11,5],[12,3,13,3],[17,3,19,3],[17,4,19,4],[17,5,19,5],[1,1,3,2],[1,3,3,17],[5,1,5,3],[5,4,6,4],[5,5,6,5],[5,6,6,6],[5,7,5,13],[5,14,5,16],[5,17,6,17]]}
[]
[null,null,null,"PLAN ANTICORRUPCIÓN Y DE ATENCIÓN AL CIUDADANO 2020\nComponente 1: Gestión del Riesgo de Corrupción"]
[]
[]
[]
[null,"Fuentes de Diagnóstico ",null,null,"Diagnóstico","Componente Plan Anticorrupción y Atención al Ciudadano ","Categoría/Proyecto/Fase","Cronograma",null,null,null,null,null,null,"Recursos",null,null,"Política de Gestión y Desempeño"]
{"$rows_left_out":15}
{"sheet":"PAAC_Trámites","index":11,"n_rows":12,"n_cols":18,"rows_kept":12,"cut":false,"hidden":false,"merged":[[7,14,11,14],[7,15,11,15],[7,16,11,16],[7,17,11,17],[1,1,3,17],[5,1,5,3],[5,4,6,4],[5,5,6,5],[5,6,6,6],[5,7,5,13],[5,14,5,16],[5,17,6,17]]}
[]
[null,"PLAN ANTICORRUPCIÓN Y DE ATENCIÓN AL CIUDADANO 2020\nComponente 2: Racionalización de Trámites"]
[]
[]
[]
[null,"Fuentes de Diagnóstico ",null,null,"Diagnóstico","Componente Plan Anticorrupción y Atención al Ciudadano ","Categoría/Proyecto/Fase","Cronograma",null,null,null,null,null,null,"Recursos",null,null,"Política de Gestión y Desempeño"]
{"$rows_left_out":7}
{"sheet":"PAAC_Rendición_de_Cuentas","index":12,"n_rows":23,"n_cols":18,"rows_kept":23,"cut":false,"hidden":false,"merged":[[7,6,12,6],[7,15,22,15],[7,17,22,17],[13,6,18,6],[19,6,22,6],[7,1,22,1],[7,2,22,2],[7,3,22,3],[7,4,22,4],[7,5,22,5],[1,1,3,17],[5,1,5,3],[5,4,6,4],[5,5,6,5],[5,6,6,6],[5,7,5,13],[5,14,5,16],[5,17,6,17]]}
[]
[null,"PLAN ANTICORRUPCIÓN Y DE ATENCIÓN AL CIUDADANO 2020\nComponente 3: Rendición de Cuentas"]
[]
[]
[]
[null,"Fuentes de Diagnóstico ",null,null,"Diagnóstico","Componente Plan Anticorrupción y Atención al Ciudadano ","Categoría/Proyecto/Fase","Cronograma",null,null,null,null,null,null,"Recursos",null,null,"Política de Gestión y Desempeño"]
{"$rows_left_out":18}
{"sheet":"PAAC_Atención_al_Ciudadano","index":13,"n_rows":10,"n_cols":18,"rows_kept":10,"cut":false,"hidden":false,"merged":[[7,14,9,14],[7,15,9,15],[7,16,9,16],[7,17,9,17],[1,1,3,2],[1,3,3,17],[5,1,5,3],[5,4,6,4],[5,5,6,5],[5,6,6,6],[5,7,5,13],[5,14,5,16],[5,17,6,17]]}
[]
[null,null,null,"PLAN ANTICORRUPCIÓN Y DE ATENCIÓN AL CIUDADANO 2020\nComponente 4: Mecanismos para mejorar la Atención al Ciudadano"]
[]
[]
[]
[null,"Fuentes de Diagnóstico ",null,null,"Diagnóstico","Componente Plan Anticorrupción y Atención al Ciudadano ","Categoría/Proyecto/Fase","Cronograma",null,null,null,null,null,null,"Recursos",null,null,"Política de Gestión y Desempeño"]
{"$rows_left_out":5}
{"sheet":"PAAC_Transparencia","index":14,"n_rows":17,"n_cols":18,"rows_kept":17,"cut":false,"hidden":false,"merged":[[7,13,11,13],[7,15,16,15],[7,16,16,16],[7,17,16,17],[13,6,16,6],[13,13,16,13],[7,6,9,6],[7,1,16,1],[7,2,16,2],[7,3,16,3],[7,4,16,4],[7,5,16,5],[1,1,3,2],[1,3,3,17],[5,1,5,3],[5,4,6,4],[5,5,6,5],[5,6,6,6],[5,7,5,13],[5,14,5,16],[5,17,6,17]]}
[]
[null,null,null,"PLAN ANTICORRUPCIÓN Y DE ATENCIÓN AL CIUDADANO 2020\nComponente 5: Mecanismos para la Transparencia y Acceso a la Información"]
[]
[]
[]
[null,"Fuentes de Diagnóstico ",null,null,"Diagnóstico","Componente Plan Anticorrupción y Atención al Ciudadano ","Categoría/Proyecto/Fase","Cronograma",null,null,null,null,null,null,"Recursos",null,null,"Política de Gestión y Desempeño"]
{"$rows_left_out":12}
{"sheet":"Otras Iniciativas","index":15,"n_rows":8,"n_cols":18,"rows_kept":8,"cut":false,"hidden":false,"merged":[[1,1,3,2],[1,3,3,17],[5,1,5,3],[5,4,6,4],[5,5,6,5],[5,6,6,6],[5,7,5,13],[5,14,5,16],[5,17,6,17]]}
[]
[null,null,null,"PLAN ANTICORRUPCIÓN Y DE ATENCIÓN AL CIUDADANO 2020\nComponente 6: Iniciativas Adicionales"]
[]
[]
[]
[null,"Fuentes de Diagnóstico ",null,null,"Diagnóstico","Componente Plan Anticorrupción y Atención al Ciudadano ","Categoría/Proyecto/Fase","Cronograma",null,null,null,null,null,null,"Recursos",null,null,"Política de Gestión y Desempeño"]
{"$rows_left_out":3}
{"sheet":"Anexo 1 Ide y Ana Riesgos","index":16,"n_rows":120,"n_cols":9,"rows_kept":120,"cut":false,"hidden":false,"merged":[[112,8,115,8],[117,1,118,1],[117,2,118,2],[117,3,118,3],[117,4,118,4],[117,6,118,6],[117,7,118,7],[117,8,118,8],[112,1,115,1],[112,2,115,2],[112,3,115,3],[112,4,115,4],[112,6,115,6],[112,7,115,7],[107,8,109,8],[110,1,111,1],[110,2,111,2],[110,3,111,3],[110,4,111,4],[110,6,111,6],[110,7,111,7],[110,8,111,8],[107,1,109,1],[107,2,109,2],[107,3,109,3],[107,4,109,4],[107,6,109,6],[107,7,109,7],[98,8,100,8],[105,1,106,1],[105,2,106,2],[105,3,106,3],[105,4,106,4],[105,6,106,6],[105,7,106,7],[105,8,106,8],[98,1,100,1],[98,2,100,2],[98,3,100,3],[98,4,100,4],[98,6,100,6],[98,7,100,7],[91,8,92,8],[94,1,97,1],[94,2,97,2],[94,3,97,3],[94,4,97,4],[94,6,97,6],[94,7,97,7],[94,8,97,8],[91,1,92,1],[91,2,92,2],[91,3,92,3],[91,4,92,4],[91,6,92,6],[91,7,92,7],[87,8,88,8],[89,1,90,1],[89,2,90,2],[89,3,90,3],[89,4,90,4],[89,6,90,6],[89,7,90,7],[89,8,90,8],[87,1,88,1],[87,2,88,2],[87,3,88,3],[87,4,88,4],[87,6,88,6],[87,7,88,7],[79,8,81,8],[85,1,86,1],[85,2,86,2],[85,3,86,3],[85,4,86,4],[85,6,86,6],[85,7,86,7],[85,8,86,8],[79,1,81,1],[79,2,81,2],[79,3,81,3],[79,4,81,4],[79,6,81,6],[79,7,81,7],[71,8,72,8],[75,1,77,1],[75,2,77,2],[75,3,77,3],[75,4,77,4],[75,6,77,6],[75,7,77,7],[75,8,77,8],[71,1,72,1],[71,2,72,2],[71,3,72,3],[71,4,72,4],[71,6,72,6],[71,7,72,7],[64,8,67,8],[68,1,70,1],[68,2,70,2],[68,3,70,3],[68,4,70,4],[68,6,70,6],[68,7,70,7],[68,8,70,8],[64,1,67,1],[64,2,67,2],[64,3,67,3],[64,4,67,4],[64,6,67,6],[64,7,67,7],[57,8,60,8],[61,1,63,1],[61,2,63,2],[61,3,63,3],[61,4,63,4],[61,6,63,6],[61,7,63,7],[61,8,63,8],[57,1,60,1],[57,2,60,2],[57,3,60,3],[57,4,60,4],[57,6,60,6],[57,7,60,7],[53,8,54,8],[55,1,56,1],[55,2,56,2],[55,3,56,3],[55,4,56,4],[55,6,56,6],[55,7,56,7],[55,8,56,8],[53,1,54,1],[53,2,54,2],[53,3,54,3],[53,4,54,4],[53,6,54,6],[53,7,54,7],[47,8,48,8],[49,1,52,1],[49,2,52,2],[49,3,52,3],[49,4,52,4],[49,6,52,6],[49,7,52,7],[49,8,52,8],[47,1,48,1],[47,2,48,2],[47,3,48,3],[47,4,48,4],[47,6,48,6],[47,7,48,7],[40,8,43,8],[44,1,45,1],[44,2,45,2],[44,3,45,3],[44,4,45,4],[44,6,45,6],[44,7,45,7],[44,8,45,8],[40,1,43,1],[40,2,43,2],[40,3,43,3],[40,4,43,4],[40,6,43,6],[40,7,43,7],[34,8,37,8],[38,1,39,1],[38,2,39,2],[38,3,39,3],[38,4,39,4],[38,6,39,6],[38,7,39,7],[38,8,39,8],[34,1,37,1],[34,2,37,2],[34,3,37,3],[34,4,37,4],[34,6,37,6],[34,7,37,7],[26,8,29,8],[30,1,33,1],[30,2,33,2],[30,3,33,3],[30,4,33,4],[30,6,33,6],[30,7,33,7],[30,8,33,8],[26,1,29,1],[26,2,29,2],[26,3,29,3],[26,4,29,4],[26,6,29,6],[26,7,29,7],[17,8,21,8],[23,1,24,1],[23,2,24,2],[23,3,24,3],[23,4,24,4],[23,6,24,6],[23,7,24,7],[23,8,24,8],[17,1,21,1],[17,2,21,2],[17,3,21,3],[17,4,21,4],[17,6,21,6],[17,7,21,7],[0,3,1,7],[7,8,10,8],[11,1,16,1],[11,2,16,2],[11,3,16,3],[11,4,16,4],[11,6,16,6],[11,7,16,7],[11,8,16,8],[7,1,10,1],[7,2,10,2],[7,3,10,3],[7,4,10,4],[7,6,10,6],[7,7,10,7],[2,0,3,0],[2,1,3,1],[2,2,3,2],[2,3,3,3],[2,4,2,5],[2,6,3,6],[2,7,3,7],[2,8,3,8],[4,1,6,1],[4,2,6,2],[4,3,6,3],[4,4,6,4],[4,6,6,6],[4,7,6,7],[4,8,6,8]]}
[null,null,null,"MAPA DE RIESGOS DE CORRUPCIÓN V 12\nUNIDAD DE GESTIÓN PENSIONAL Y PARAFISCALES"]
[]
["No","Macroproceso","Proceso","Código del Riesgo","Riesgo",null,"Probabilidad","Impacto","Severidad Residual del Riesgo "]
[null,null,null,null,"Evento","Causas"]
[null,"Gestión de Servicio al Ciudadano","Gestión de Relaciones con el Ciudadano, Clientes Parafiscales y Grupos de Interés","SC-RC-002","Entregar información (de datos  básicos y del trámite) de ciudadanos de Pensiones y Parafiscales, a personas no autorizadas,  en favorecimiento propio y/o de un tercero.","Suplantación de identidad",{"$f":"+IFERROR(VLOOKUP(D5,'[1]Soporte Probabilidad'!A:I,8,FALSE),\"\")","v":"Improbable"},{"$f":"+IFERROR(VLOOKUP(D5,'[1]Soporte Impacto'!$A:$V,22,FALSE),\"\")","v":"Mayor"},"Alta"]
[null,null,null,null,null,"Acceso no autorizado al información sensible de los ciudadanos"]
{"$rows_left_out":115}
{"sheet":"PETI","index":17,"n_rows":26,"n_cols":11,"rows_kept":26,"cut":false,"hidden":false,"merged":[[1,4,11,8],[19,2,25,2],[18,1,25,1]]}
[]
[null,null,null,null,"PLAN ESTRATÉGICO DE TECNOLOGÍAS DE LA INFORMACIÓN Y LAS COMUNICACIONES \nPETI 2020"]
[]
[]
[]
[]
{"$rows_left_out":21}
{"sheet":"Tratamiento_de_riesgos","index":18,"n_rows":20,"n_cols":7,"rows_kept":20,"cut":false,"hidden":false,"merged":[[17,4,17,6],[17,1,17,3],[1,3,11,5],[19,1,19,3]]}
[]
[null,null,null,"PLAN DE TRATAMIENTO DE RIESGOS DE SEGURIDAD Y PRIVACIDAD DE LA INFORMACIÓN 2020"]
[]
[]
[]
[]
{"$rows_left_out":15}
{"sheet":"Seguridad_de_Información","index":19,"n_rows":24,"n_cols":11,"rows_kept":24,"cut":false,"hidden":false,"merged":[[1,3,11,8],[15,1,24,1],[15,2,24,2]]}
[]
[null,null,null,"PLAN DE SEGURIDAD Y PRIVACIDAD DE LA INFORMACIÓN 2020"]
[]
[]
[]
[]
{"$rows_left_out":19}
{"sheet":"Riesgos","index":20,"n_rows":20,"n_cols":18,"rows_kept":20,"cut":false,"hidden":false,"merged":[[14,3,16,3],[14,4,16,4],[14,5,16,5],[17,3,19,3],[17,4,19,4],[17,5,19,5],[9,4,11,4],[9,5,11,5],[12,3,13,3],[12,4,13,4],[12,5,13,5],[7,1,19,1],[7,2,19,2],[7,3,8,3],[7,4,8,4],[1,3,3,17],[1,1,3,2],[5,6,6,6],[5,5,6,5],[5,4,6,4],[5,7,5,13],[5,17,6,17],[5,14,5,16],[5,1,5,3],[7,5,8,5],[7,17,19,17],[9,3,11,3]]}
[]
[null,null,null,"PLAN ANTICORRUPCIÓN Y DE ATENCIÓN AL CIUDADANO 2019\nComponente: Riesgos de Corrupción"]
[]
[]
[]
[null,"Fuentes de Diagnóstico ",null,null,"Diagnóstico","Componente Plan Anticorrupción y Atención al Ciudadano ","Categoría/Proyecto/Fase","Cronograma",null,null,null,null,null,null,"Recursos",null,null,"Política de Gestión y Desempeño"]
{"$rows_left_out":15}
{"sheet":"Trámites","index":21,"n_rows":11,"n_cols":18,"rows_kept":11,"cut":false,"hidden":true,"merged":[[7,14,10,14],[7,15,10,15],[7,16,10,16],[7,17,10,17],[1,1,3,17],[5,4,6,4],[5,5,6,5],[5,6,6,6],[5,7,5,13],[5,14,5,16],[5,1,5,3],[5,17,6,17]]}
[]
[null,"PLAN ANTICORRUPCIÓN Y DE ATENCIÓN AL CIUDADANO 2019\nComponente: Racionalización de Trámites"]
[]
[]
[]
[null,"Fuentes de Diagnóstico ",null,null,"Diagnóstico","Componente Plan Anticorrupción y Atención al Ciudadano ","Categoría/Proyecto/Fase","Cronograma",null,null,null,null,null,null,"Recursos",null,null,"Política de Gestión y Desempeño"]
{"$rows_left_out":6}
{"sheet":"Rendición_de_Cuentas","index":22,"n_rows":24,"n_cols":18,"rows_kept":24,"cut":false,"hidden":true,"merged":[[1,1,3,17],[5,1,5,3],[5,4,6,4],[5,5,6,5],[5,6,6,6],[5,7,5,13],[5,14,5,16],[5,17,6,17],[7,1,23,1],[7,2,23,2],[7,3,23,3],[7,15,23,15],[7,17,23,17],[7,4,23,4],[7,13,23,13],[7,16,8,16],[19,16,23,16],[8,6,15,6],[16,6,18,6],[19,6,23,6],[7,5,23,5]]}
[]
[null,"PLAN ANTICORRUPCIÓN Y DE ATENCIÓN AL CIUDADANO 2019\nComponente: Rendición de Cuentas"]
[]
[]
[]
[null,"Fuentes de Diagnóstico ",null,null,"Diagnóstico","Componente Plan Anticorrupción y Atención al Ciudadano ","Categoría/Proyecto/Fase","Cronograma",null,null,null,null,null,null,"Recursos",null,null,"Política de Gestión y Desempeño"]
{"$rows_left_out":19}
{"sheet":"Transparencia","index":23,"n_rows":17,"n_cols":18,"rows_kept":17,"cut":false,"hidden":true,"merged":[[5,7,5,13],[5,14,5,16],[5,17,6,17],[7,4,16,4],[7,13,11,13],[13,13,16,13],[7,1,16,1],[7,2,16,2],[7,3,16,3],[1,3,3,17],[5,1,5,3],[5,4,6,4],[1,1,3,2],[7,15,16,15],[7,16,16,16],[7,17,16,17],[5,5,6,5],[5,6,6,6],[7,5,16,5],[7,6,9,6],[12,7,12,14],[13,6,16,6]]}
[]
[null,null,null,"PLAN ANTICORRUPCIÓN Y DE ATENCIÓN AL CIUDADANO\nComponente: Mecanismos para la Transparencia y Acceso a la Información"]
[]
[]
[]
[null,"Fuentes de Diagnóstico ",null,null,"Diagnóstico","Componente Plan Anticorrupción y Atención al Ciudadano ","Categoría/Proyecto/Fase","Cronograma",null,null,null,null,null,null,"Recursos",null,null,"Política de Gestión y Desempeño"]
{"$rows_left_out":12}
{"sheet":"Atención_al_Ciudadano","index":24,"n_rows":11,"n_cols":18,"rows_kept":11,"cut":false,"hidden":true,"merged":[[7,5,10,5],[1,3,3,17],[5,1,5,3],[5,4,6,4],[5,5,6,5],[1,1,3,2],[5,6,6,6],[5,7,5,13],[5,14,5,16],[5,17,6,17],[7,15,11,15],[7,16,11,16],[7,17,11,17],[7,14,11,14],[8,6,10,6]]}
[]
[null,null,null,"PLAN ANTICORRUPCIÓN Y DE ATENCIÓN AL CIUDADANO\nComponente: Mecanismos para mejorar la Atención al Ciudadano"]
[]
[]
[]
[null,"Fuentes de Diagnóstico ",null,null,"Diagnóstico","Componente Plan Anticorrupción y Atención al Ciudadano ","Categoría/Proyecto/Fase","Cronograma",null,null,null,null,null,null,"Recursos",null,null,"Política de Gestión y Desempeño"]
{"$rows_left_out":6}
{"sheet":"Otras","index":25,"n_rows":8,"n_cols":18,"rows_kept":8,"cut":false,"hidden":true,"merged":[[5,4,6,4],[5,5,6,5],[5,6,6,6],[1,1,3,2],[1,3,3,17],[5,1,5,3],[5,17,6,17],[5,7,5,13],[5,14,5,16]]}
[]
[null,null,null,"PLAN ANTICORRUPCIÓN Y DE ATENCIÓN AL CIUDADANO 2019\nComponente: Iniciativas Adicionales"]
[]
[]
[]
[null,"Fuentes de Diagnóstico ",null,null,"Diagnóstico","Componente Plan Anticorrupción y Atención al Ciudadano ","Categoría/Proyecto/Fase","Cronograma",null,null,null,null,null,null,"Recursos",null,null,"Política de Gestión y Desempeño"]
{"$rows_left_out":3}
{"sheet":"Proyectos de Inversión BPIN","index":26,"n_rows":15,"n_cols":7,"rows_kept":15,"cut":false,"hidden":false,"merged":[[14,0,14,3],[14,5,14,6]]}
[]
[]
[]
[]
[]
[]
{"$rows_left_out":9}