{"text_format":"1","workbook":"xlsx","n_sheets":21,"sheets":["Integración_PAA","Plan_de_Acción_Anual_2021","PINAR","Plan_de_Vacantes","Plan_de_Previsión","PETH","PIC","Plan_de_Incentivos","PSST","PAAC","PETI","Tratamiento_de_riesgos","Seguridad_de_Información","Riesgos","Trámites","Rendición_de_Cuentas","Transparencia","Atención_al_Ciudadano","Otras","Proyectos de Inversión BPIN","Anexo 1 Ide y Ana Riesgos"],"not_rendered":{"charts":0,"images":10,"macros":1,"external_links":3,"defined_names":36,"comments":0,"pivot_tables":0},"unopened":[],"bounds":{"document_bytes":16777216,"sheet_cells":100000,"rows_first":2000,"rows_last":500,"rows_between":2000,"halvings":0,"cell_chars":16384,"cell_head_chars":4096},"cells_cut":0,"cells_raw":0,"read":"whole","date_system":"1900"}

{"sheet":"Integración_PAA","index":0,"n_rows":66,"n_cols":2,"rows_kept":66,"cut":false,"hidden":false,"merged":[[53,12,53,14],[65,1,65,14]]}
[]
[]
[]
[]
[]
[]
[]
[]
{"$rows_left_out":59}
{"sheet":"Plan_de_Acción_Anual_2021","index":1,"n_rows":49,"n_cols":18,"rows_kept":49,"cut":false,"hidden":false,"merged":[[1,3,11,11]]}
[]
[null,null,null,"PLAN DE ACCIÓN ANUAL 2021"]
[]
[]
[]
[]
[]
[]
{"$rows_left_out":42}
{"sheet":"PINAR","index":2,"n_rows":25,"n_cols":11,"rows_kept":25,"cut":false,"hidden":false,"merged":[[1,3,11,8]]}
[]
[null,null,null,"PLAN INSTITUCIONAL DE ARCHIVOS - PINAR 2021"]
[]
[]
[]
[]
[]
[]
{"$rows_left_out":18}
{"sheet":"Plan_de_Vacantes","index":3,"n_rows":17,"n_cols":11,"rows_kept":17,"cut":false,"hidden":false,"merged":[[1,2,11,10]]}
[]
[null,null,"PLAN ANUAL DE VACANTES 2021"]
[]
[]
[]
[]
[]
[]
{"$rows_left_out":10}
{"sheet":"Plan_de_Previsión","index":4,"n_rows":17,"n_cols":11,"rows_kept":17,"cut":false,"hidden":false,"merged":[[1,4,11,7]]}
[]
[null,null,null,null,"PLAN ANUAL DE PREVISIÓN DE RECURSOS HUMANOS 2021"]
[]
[]
[]
[]
[]
[]
{"$rows_left_out":10}
{"sheet":"PETH","index":5,"n_rows":0,"n_cols":0,"rows_kept":0,"cut":false,"hidden":false,"merged":[[40,2,40,21]]}

{"sheet":"PIC","index":6,"n_rows":65,"n_cols":11,"rows_kept":65,"cut":false,"hidden":false,"merged":[[1,4,11,8]]}
[]
[null,null,null,null,"PLAN INSTITUCIONAL DE CAPACITACIÓN - PIC 2021"]
[]
[]
[]
[]
[]
[]
{"$rows_left_out":58}
{"sheet":"Plan_de_Incentivos","index":7,"n_rows":68,"n_cols":11,"rows_kept":68,"cut":false,"hidden":false,"merged":[[1,4,11,8]]}
[]
[null,null,null,null,"PLAN DE BIENESTAR E INCENTIVOS INSTITUCIONALES 2021"]
[]
[]
[]
[]
[]
[]
{"$rows_left_out":61}
{"sheet":"PSST","index":8,"n_rows":36,"n_cols":11,"rows_kept":36,"cut":false,"hidden":false,"merged":[[1,4,11,8]]}
[]
[null,null,null,null,"PLAN DE TRABAJO ANUAL EN SEGURIDAD \nY SALUD EN EL TRABAJO - PSST 2021"]
[]
[]
[]
[]
[]
[]
{"$rows_left_out":29}
{"sheet":"PAAC","index":9,"n_rows":38,"n_cols":6,"rows_kept":38,"cut":false,"hidden":false,"merged":[[37,5,37,8]]}
[" "]
[]
[]
[]
[]
[]
[]
[]
{"$rows_left_out":31}
{"sheet":"PETI","index":10,"n_rows":26,"n_cols":11,"rows_kept":26,"cut":false,"hidden":false,"merged":[[1,3,11,8],[18,1,25,1],[18,9,25,9]]}
[]
[null,null,null,"PLAN ESTRATÉGICO DE TECNOLOGÍAS DE LA INFORMACIÓN Y LAS COMUNICACIONES - PETI 2021"]
[]
[]
[]
[]
[]
[]
{"$rows_left_out":19}
{"sheet":"Tratamiento_de_riesgos","index":11,"n_rows":20,"n_cols":7,"rows_kept":20,"cut":false,"hidden":false,"merged":[[17,4,17,6],[17,1,17,3],[1,3,11,5]]}
[]
[null,null,null,"PLAN DE TRATAMIENTO DE RIESGOS DE SEGURIDAD Y PRIVACIDAD DE LA INFORMACIÓN 2021"]
[]
[]
[]
[]
[]
[]
{"$rows_left_out":13}
{"sheet":"Seguridad_de_Información","index":12,"n_rows":22,"n_cols":11,"rows_kept":22,"cut":false,"hidden":false,"merged":[[1,3,11,8],[15,1,21,1],[15,2,21,2],[15,9,21,9],[15,8,21,8]]}
[]
[null,null,null,"PLAN DE SEGURIDAD Y PRIVACIDAD DE LA INFORMACIÓN 2021"]
[]
[]
[]
[]
[]
[]
{"$rows_left_out":15}
{"sheet":"Riesgos","index":13,"n_rows":20,"n_cols":18,"rows_kept":20,"cut":false,"hidden":true,"merged":[[1,1,3,2],[1,3,3,17],[7,17,19,17],[7,1,19,1],[7,2,19,2],[9,3,11,3],[9,4,11,4],[9,5,11,5],[12,3,13,3],[12,4,13,4],[12,5,13,5],[14,3,16,3],[14,4,16,4],[14,5,16,5],[17,3,19,3],[17,4,19,4],[17,5,19,5],[5,6,6,6],[5,5,6,5],[5,4,6,4],[5,7,5,13],[5,17,6,17],[5,14,5,16],[5,1,5,3],[7,5,8,5],[7,3,8,3],[7,4,8,4]]}
[]
[null,null,null,"PLAN ANTICORRUPCIÓN Y DE ATENCIÓN AL CIUDADANO 2021\nComponente 1: Gestión del Riesgo de Corrupción"]
[]
[]
[]
[null,"Fuentes de Diagnóstico ",null,null,"Diagnóstico","Componente Plan Anticorrupción y Atención al Ciudadano ","Categoría/Proyecto/Fase","Cronograma",null,null,null,null,null,null,"Recursos",null,null,"Política de Gestión y Desempeño"]
[null,"Fuentes ","Información utilizada","Oportunidad de Mejora",null,null,null,"Nombre de la tarea","Meta o producto","Responsable de aprobar tarea ","Responsable de ejecutar tarea ","Fecha Inicio","Fecha Fin","Proceso ","Área Organizativa o Dependencia Responsable","Fuente de Financiación \n(Inversión, Funcionamiento, otros)","Tecnológicos"]
[null,"* Grupo Internno de Trabajo de Gestión de Riesgos, Dirección de Seguimiento y Mejoramiento de Procesos\n* Manual Sistema de Gestión de Riesgos UGPP\n* Site de Sistema de Gestión de Riesgos de la UGPP","Continuar con la práctica de revisión y actualización de la política de gestión de riesgos.","* La política se ajusta a las necesidades de la entidad y es revisada y actualizada frecuentemente por el equipo Directivo de la UGPP.\n* La política de Sistema de Gestión de Riegos se divulga permanentemente a todos los funcionarios a través de los mecanismos dispuestos por la Oficina de Comunicaciones","* La política se ajusta a las necesidades de la entidad y es revisada y actualizada frecuentemente por el equipo Directivo de la UGPP.\n* La política de Sistema de Gestión de Riegos se divulga permanentemente a todos los funcionarios a través de los mecanismos dispuestos por la Oficina de Comunicaciones","Política de Administración de Riesgos de Corrupción","N/A","Someter a revisión del Comité Directivo de la UGPP la política de Administración de Riesgos de Corrupción.","Acta del Comité Directivo.","Director de Seguimiento y Mejoramiento de Procesos","Darleny Consuelo Fajardo","2021-03-01","2021-04-30","Administrar riesgos corporativos","Dirección de Seguimiento y Mejoramiento de Procesos","Funcionamiento","N/A","Planeación Institucional"]
{"$rows_left_out":13}
{"sheet":"Trámites","index":14,"n_rows":19,"n_cols":18,"rows_kept":19,"cut":false,"hidden":true,"merged":[[5,1,5,6],[5,7,5,17],[1,1,3,17],[6,4,7,4],[6,5,7,5],[6,6,7,6],[6,7,6,13],[6,14,6,16],[6,1,6,3],[6,17,7,17]]}
[]
[null,"PLAN ANTICORRUPCIÓN Y DE ATENCIÓN AL CIUDADANO 2021\nComponente: Racionalización de Trámites"]
[]
[]
[]
[null,null,null,null,null,null,null,"Objetivo del Componente: Implementar acciones administrativas o tecnológicas tendientes a simplificar, estandarizar, eliminar, optimizar y automatizar los trámites y OPA's priorizados por La Unidad, reduciendo costos, tiempos, documentos y pasos, para facilitar el acceso de los ciudadanos y aportantes a sus derechos. "]
[null,"Fuentes de Diagnóstico ",null,null,"Diagnóstico","Componente Plan Anticorrupción y Atención al Ciudadano ","Categoría/Proyecto/Fase","Cronograma",null,null,null,null,null,null,"Recursos",null,null,"Política de Gestión y Desempeño"]
[null,"Fuentes ","Información utilizada","Oportunidad de Mejora",null,null,null,"Nombre de la tarea","Meta o producto","Responsable de aprobar tarea ","Responsable de ejecutar tarea ","Fecha Inicio","Fecha Fin","Proceso ","Área Organizativa o Dependencia Responsable","Fuente de Financiación \n(Inversión, Funcionamiento, otros)","Tecnológicos"]
{"$rows_left_out":12}
{"sheet":"Rendición_de_Cuentas","index":15,"n_rows":29,"n_cols":18,"rows_kept":29,"cut":false,"hidden":true,"merged":[[7,17,28,17],[7,15,28,15],[7,6,12,6],[13,6,20,6],[7,13,28,13],[21,6,28,6],[7,1,28,1],[7,2,28,2],[7,3,28,3],[7,4,28,4],[7,5,28,5],[1,1,3,17],[5,1,5,3],[5,4,6,4],[5,5,6,5],[5,6,6,6],[5,7,5,13],[5,14,5,16],[5,17,6,17]]}
[]
[null,"PLAN ANTICORRUPCIÓN Y DE ATENCIÓN AL CIUDADANO 2021\nComponente: Participación y Rendición de Cuentas"]
[]
[]
[]
[null,"Fuentes de Diagnóstico ",null,null,"Diagnóstico","Componente Plan Anticorrupción y Atención al Ciudadano ","Categoría/Proyecto/Fase","Cronograma",null,null,null,null,null,null,"Recursos",null,null,"Política de Gestión y Desempeño"]
[null,"Fuentes ","Información utilizada","Oportunidad de Mejora",null,null,null,"Nombre de la tarea","Meta o producto","Responsable de aprobar tarea ","Responsable de ejecutar tarea ","Fecha Inicio","Fecha Fin","Proceso ","Área Organizativa o Dependencia Responsable","Fuente de Financiación \n(Inversión, Funcionamiento, otros)","Tecnológicos"]
[null,"Modelo Integrado de Planeación y Gestión\nFURAG\nHerramienta de autodiagnóstico DAFP","Experiencia de la Entidad en vigencias anteriores.\nResultados FURAG anteriores.\nAnálisis de autodiagnóstico.\nConsulta a ciudadanos 2021.","Identificación de debilidades y fortalezas.\nIdentificación de grupos de valor en el marco de la rendición de cuentas.\nRecomendaciones FURAG.","Resultado FURAG 2019 en la política de Participación Ciudadana y Rendición de Cuentas: 93,8 puntos (2018: 82,5 puntos).\nÍndice de rendición de cuentas en la gestión pública 2019: 91 puntos (2018: 84,6 puntos).","Rendición de cuentas","Información de calidad y en lenguaje comprensible","Consultar a los ciudadanos temas y contenidos para la rendición de cuentas.","Resultados de consulta consolidados.","Director de Estrategia y Evaluación","Grupo de Comunicaciones\nDirección de Estrategia y Evaluación","2021-03-02","2022-01-31","Seguimiento y evaluación de la gestión","Grupo de Comunicaciones\nDirección de Estrategia y Evaluación","Funcionamiento","Correos electrónicos - Formularios de Google","Participación ciudadana en la gestión pública\nTransparencia, acceso a la información pública y lucha contra la corrupción"]
{"$rows_left_out":22}
{"sheet":"Transparencia","index":16,"n_rows":17,"n_cols":18,"rows_kept":17,"cut":false,"hidden":true,"merged":[[7,1,16,1],[7,2,16,2],[7,3,16,3],[1,3,3,17],[5,1,5,3],[5,4,6,4],[1,1,3,2],[7,15,16,15],[5,5,6,5],[5,6,6,6],[7,5,16,5],[7,6,9,6],[13,6,16,6],[12,7,12,12],[5,7,5,13],[5,14,5,16],[5,17,6,17],[7,4,16,4],[7,13,12,13],[14,13,16,13]]}
[]
[null,null,null,"PLAN ANTICORRUPCIÓN Y DE ATENCIÓN AL CIUDADANO 2021\nComponente: Mecanismos para la Transparencia y Acceso a la Información"]
[]
[]
[]
[null,"Fuentes de Diagnóstico ",null,null,"Diagnóstico","Componente Plan Anticorrupción y Atención al Ciudadano ","Categoría/Proyecto/Fase","Cronograma",null,null,null,null,null,null,"Recursos",null,null,"Política de Gestión y Desempeño"]
[null,"Fuentes ","Información utilizada","Oportunidad de Mejora",null,null,null,"Nombre de la tarea","Meta o producto","Responsable de aprobar tarea ","Responsable de ejecutar tarea ","Fecha Inicio","Fecha Fin","Proceso ","Área Organizativa o Dependencia Responsable","Fuente de Financiación \n(Inversión, Funcionamiento, otros)","Tecnológicos"]
[null,"Ley 1712 de 2014","Requerimientos establecido en la norma ","Revisa y actualizar periodicamente","De acuerdo con la auditoria realizada por la Procuraduria General de la Nacion la entidad ha dado cumplimiento al Indice de Transparencia Activa en un 94%","Transparencia y Acceso a la Informacion Publica","Lineamientos de Transparenia Activa","Diagnóstico cuatrimesral de publicaciones en la págna web de acuerdo con la ley (matriz de autodiagnóstico emitida por la Procuraduria General de la Nación).","Matriz de autodiagnóstico, diligenciada cada 4 meses ","Director de Soporte y Desarrollo Organizacional","Dirección de Soporte y Desarrolo Organizacional","2021-01-01","2021-12-31","Gestión de las comunicaciones","Dirección de Soporte y Desarrollo Organizacional","Funcionamiento","Pagina WEB UGPP","Transparencia y acceso a la Informacion"]
{"$rows_left_out":10}
{"sheet":"Atención_al_Ciudadano","index":17,"n_rows":11,"n_cols":18,"rows_kept":11,"cut":false,"hidden":true,"merged":[[7,5,10,5],[1,3,3,17],[5,1,5,3],[5,4,6,4],[5,5,6,5],[1,1,3,2],[5,6,6,6],[5,7,5,13],[5,14,5,16],[5,17,6,17]]}
[]
[null,null,null,"PLAN ANTICORRUPCIÓN Y DE ATENCIÓN AL CIUDADANO 2021\nComponente: Mecanismos para mejorar la Atención al Ciudadano"]
[]
[]
[]
[null,"Fuentes de Diagnóstico ",null,null,"Diagnóstico","Componente Plan Anticorrupción y Atención al Ciudadano ","Categoría/Proyecto/Fase","Cronograma",null,null,null,null,null,null,"Recursos",null,null,"Política de Gestión y Desempeño"]
[null,"Fuentes ","Información utilizada","Oportunidad de Mejora",null,null,null,"Nombre de la tarea","Descripción ","Responsable de aprobar tarea ","Responsable de ejecutar tarea ","Fecha Inicio","Fecha Fin","Proceso ","Área Organizativa o Dependencia Responsable","Fuente de Financiación \n(Inversión, Funcionamiento, otros)","Tecnológicos"]
[null,"Otros","Estrategias para la construcción de Plan Anticorrupción y FURAG","Implementación o viablidad del servicio de inclusión de servicios de personas con algún tipo de discapacidad.","En la Unidad se observó la existencia de una oportunidad para mejorar los servicios de atención al ciudadano en la página web en donde exista información de consulta para personas con algún tipo de discapacidad visa y auditiva.","Mecanismos para mejorar la atención al ciudadano.","Fortalecimiento de los Canales de Atención","Implementación de servicios del INSOR e INCI.","Acceso a la información a ciudadanos con Discapacidad","Luz Dary Mendoza","Norma Angel","2021-01-02","2021-11-30","Atención al Ciudadano","Dirección de Servicios Integrados de Atención","Funcionamiento","Gestion para adecuar pagina web","Servicio al ciudadano"]
{"$rows_left_out":4}
{"sheet":"Otras","index":18,"n_rows":17,"n_cols":18,"rows_kept":17,"cut":false,"hidden":true,"merged":[[7,1,16,1],[9,6,10,6],[11,6,12,6],[15,6,16,6],[7,6,8,6],[7,5,16,5],[7,4,16,4],[7,3,16,3],[7,2,16,2],[5,4,6,4],[5,5,6,5],[5,6,6,6],[1,1,3,2],[1,3,3,17],[5,1,5,3],[5,17,6,17],[5,7,5,13],[5,14,5,16]]}
[]
[null,null,null,"PLAN ANTICORRUPCIÓN Y DE ATENCIÓN AL CIUDADANO 2021\nComponente: Iniciativas Adicionales"]
[]
[]
[]
[null,"Fuentes de Diagnóstico ",null,null,"Diagnóstico","Componente Plan Anticorrupción y Atención al Ciudadano ","Categoría/Proyecto/Fase","Cronograma",null,null,null,null,null,null,"Recursos",null,null,"Política de Gestión y Desempeño"]
[null,"Fuentes ","Información utilizada","Oportunidad de Mejora",null,null,null,"Nombre de la tarea","Descripción ","Responsable de aprobar tarea ","Responsable de ejecutar tarea ","Fecha Inicio","Fecha Fin","Proceso ","Área Organizativa o Dependencia Responsable","Fuente de Financiación \n(Inversión, Funcionamiento, otros)","Tecnológicos"]
[null,"Modelo Integrado de Planeación y Gestión\nAutodiagnóstico DAFP","Resultados de la implementación de la política de gestión y desempeño, a través del autodiagnóstico DAFP.","Desarrollar mecanismos para prevenir y controlar la aparición de conflictos de intereses en la entidad con el objeto de evitar la afectación del servicio y el interés general","Resultado de autodiagnóstico 2020: 81 / 100 puntos.\n\nFalta introducir acciones, productos o metas para la gestión de conflicto de intereses, en el Plan Institucional de la Unidad.\n\nNo se programaron actividades puntuales de pedagogía, gestión o seguimiento a los conflictos de intereses en “iniciativas adicionales” del Plan anticorrupción.\n\nLa estrategia no se valoró por el Comité Institucional de Gestión y Desempeño y no se hizo seguimiento a su implementación.\n\nNo se realizaron todo el año acciones de capacitación del trámite de los impedimentos y recusaciones.\n\nLos gerentes, servidores y contratistas no han hecho el curso de Integridad, Transparencia y Lucha contra Corrupción.","Iniciativas adicionales","Planeación - Diseño de la estrategia para la gestión de conflictos de intereses","Incorporar al Plan anual Institucional la estrategia para la gestión del conflicto de intereses y publicarlo en el sitio web.","En el Plan de Acción Anual 2021 se incorpora la Estrategia para la gestión de Conflicto de Intereses como un instrumento que integra el componente 6 \"iniciativas adicionales\" del Plan Anticorrupción 2021, previa validación en Comité Institucional de Gestión y Desempeño.\n","Director de Soporte y Desarrollo Organizacional","Dirección de Soporte y Desarrollo Organizacional/ Subdirección de Gestión Humana/Dirección de Estrategia y Evaluación","2021-01-31","2021-01-31",null,"Dirección de Soporte y Desarrollo Organizacional/ Subdirección de Gestión Humana/Dirección de Estrategia y Evaluación","Funcionamiento","N/A","Integridad"]
{"$rows_left_out":10}
{"sheet":"Proyectos de Inversión BPIN","index":19,"n_rows":14,"n_cols":7,"rows_kept":14,"cut":false,"hidden":false,"merged":[[13,0,13,3],[13,5,13,6]]}
[]
[]
[]
[]
[]
[]
[]
[]
{"$rows_left_out":7}
{"sheet":"Anexo 1 Ide y Ana Riesgos","index":20,"n_rows":127,"n_cols":9,"rows_kept":127,"cut":false,"hidden":false,"merged":[[123,1,125,1],[123,2,125,2],[123,3,125,3],[123,4,125,4],[123,6,125,6],[123,7,125,7],[123,8,125,8],[116,1,117,1],[116,2,117,2],[116,3,117,3],[116,4,117,4],[116,6,117,6],[116,7,117,7],[116,8,117,8],[118,1,121,1],[118,2,121,2],[118,3,121,3],[118,4,121,4],[118,6,121,6],[118,7,121,7],[118,8,121,8],[111,1,112,1],[111,2,112,2],[111,3,112,3],[111,4,112,4],[111,6,112,6],[111,7,112,7],[111,8,112,8],[113,1,115,1],[113,2,115,2],[113,3,115,3],[113,4,115,4],[113,6,115,6],[113,7,115,7],[113,8,115,8],[100,1,103,1],[100,2,103,2],[100,3,103,3],[100,4,103,4],[100,6,103,6],[100,7,103,7],[100,8,103,8],[104,1,106,1],[104,2,106,2],[104,3,106,3],[104,4,106,4],[104,6,106,6],[104,7,106,7],[104,8,106,8],[95,1,96,1],[95,2,96,2],[95,3,96,3],[95,4,96,4],[95,6,96,6],[95,7,96,7],[95,8,96,8],[97,1,98,1],[97,2,98,2],[97,3,98,3],[97,4,98,4],[97,6,98,6],[97,7,98,7],[97,8,98,8],[91,1,92,1],[91,2,92,2],[91,3,92,3],[91,4,92,4],[91,6,92,6],[91,7,92,7],[91,8,92,8],[93,1,94,1],[93,2,94,2],[93,3,94,3],[93,4,94,4],[93,6,94,6],[93,7,94,7],[93,8,94,8],[83,1,84,1],[83,2,84,2],[83,3,84,3],[83,4,84,4],[83,6,84,6],[83,7,84,7],[83,8,84,8],[85,1,87,1],[85,2,87,2],[85,3,87,3],[85,4,87,4],[85,6,87,6],[85,7,87,7],[85,8,87,8],[78,1,79,1],[78,2,79,2],[78,3,79,3],[78,4,79,4],[78,6,79,6],[78,7,79,7],[78,8,79,8],[80,1,82,1],[80,2,82,2],[80,3,82,3],[80,4,82,4],[80,6,82,6],[80,7,82,7],[80,8,82,8],[72,1,74,1],[72,2,74,2],[72,3,74,3],[72,4,74,4],[72,6,74,6],[72,7,74,7],[72,8,74,8],[75,1,76,1],[75,2,76,2],[75,3,76,3],[75,4,76,4],[75,6,76,6],[75,7,76,7],[75,8,76,8],[66,1,67,1],[66,2,67,2],[66,3,67,3],[66,4,67,4],[66,6,67,6],[66,7,67,7],[66,8,67,8],[68,1,71,1],[68,2,71,2],[68,3,71,3],[68,4,71,4],[68,6,71,6],[68,7,71,7],[68,8,71,8],[58,1,60,1],[58,2,60,2],[58,3,60,3],[58,4,60,4],[58,6,60,6],[58,7,60,7],[58,8,60,8],[61,1,65,1],[61,2,65,2],[61,3,65,3],[61,4,65,4],[61,6,65,6],[61,7,65,7],[61,8,65,8],[49,1,53,1],[49,2,53,2],[49,3,53,3],[49,4,53,4],[49,6,53,6],[49,7,53,7],[49,8,53,8],[54,1,57,1],[54,2,57,2],[54,3,57,3],[54,4,57,4],[54,6,57,6],[54,7,57,7],[54,8,57,8],[44,1,45,1],[44,2,45,2],[44,3,45,3],[44,4,45,4],[44,6,45,6],[44,7,45,7],[44,8,45,8],[47,1,48,1],[47,2,48,2],[47,3,48,3],[47,4,48,4],[47,6,48,6],[47,7,48,7],[47,8,48,8],[38,1,39,1],[38,2,39,2],[38,3,39,3],[38,4,39,4],[38,6,39,6],[38,7,39,7],[38,8,39,8],[40,1,43,1],[40,2,43,2],[40,3,43,3],[40,4,43,4],[40,6,43,6],[40,7,43,7],[40,8,43,8],[30,1,32,1],[30,2,32,2],[30,3,32,3],[30,4,32,4],[30,6,32,6],[30,7,32,7],[30,8,32,8],[33,1,37,1],[33,2,37,2],[33,3,37,3],[33,4,37,4],[33,6,37,6],[33,7,37,7],[33,8,37,8],[23,1,24,1],[23,2,24,2],[23,3,24,3],[23,4,24,4],[23,6,24,6],[23,7,24,7],[23,8,24,8],[26,1,29,1],[26,2,29,2],[26,3,29,3],[26,4,29,4],[26,6,29,6],[26,7,29,7],[26,8,29,8],[11,6,16,6],[11,7,16,7],[11,8,16,8],[17,1,21,1],[17,2,21,2],[17,3,21,3],[17,4,21,4],[17,6,21,6],[17,7,21,7],[17,8,21,8],[11,1,16,1],[11,2,16,2],[11,3,16,3],[11,4,16,4],[0,3,1,7],[4,1,6,1],[4,2,6,2],[4,3,6,3],[4,4,6,4],[4,6,6,6],[4,7,6,7],[4,8,6,8],[7,1,10,1],[7,2,10,2],[2,0,3,0],[2,1,3,1],[2,2,3,2],[2,3,3,3],[2,4,2,5],[2,6,3,6],[2,7,3,7],[2,8,3,8],[7,3,10,3],[7,4,10,4],[7,6,10,6],[7,7,10,7],[7,8,10,8]]}
[null,null,null,"MAPA DE RIESGOS DE CORRUPCIÓN V 13\nUNIDAD DE GESTIÓN PENSIONAL Y PARAFISCALES"]
[]
["No","Macroproceso","Proceso","Código del Riesgo","Riesgo",null,"Probabilidad","Impacto","Severidad Residual del Riesgo "]
[null,null,null,null,"Evento","Causas"]
[null,"Gestión de Servicio al Ciudadano","Gestión de Relaciones con el Ciudadano, Clientes Parafiscales y Grupos de Interés","SC-RC-002","Entregar información (de datos  básicos y del trámite) de ciudadanos de Pensiones y Parafiscales, a personas no autorizadas,  en favorecimiento propio y/o de un tercero.","Suplantación de identidad",{"$f":"+IFERROR(VLOOKUP(D5,'[1]Soporte Probabilidad'!A:I,8,FALSE),\"\")","v":"Improbable"},{"$f":"+IFERROR(VLOOKUP(D5,'[1]Soporte Impacto'!$A:$V,22,FALSE),\"\")","v":"Mayor"},{"$f":"+IFERROR(VLOOKUP(G5&H5,'[1]Listas desplegables'!$CN$3:$CO$17,2,FALSE),\"\")","v":"Alta"}]
[null,null,null,null,null,"Acceso no autorizado al información sensible de los ciudadanos"]
[null,null,null,null,null,"Bases de datos que contiene información del ciudadano, manejadas de manera compartida entre Proveedor, DSIAC y Parafiscales."]
[null,"Gestión de Servicio al Ciudadano","Gestión de Relaciones con el Ciudadano, Clientes Parafiscales y Grupos de Interés","SC-RC-003","Hurtar o usar indebidamente la información crítica y sensible de los procesos pensionales y parafiscales, recibiendo a cambio pagos y/o beneficios de terceros.","Vulnerabilidad y deficiencias de la infraestructura tecnológica o de los sistemas de información   y de su monitoreo.",{"$f":"+IFERROR(VLOOKUP(D8,'[1]Soporte Probabilidad'!A:I,8,FALSE),\"\")","v":"Improbable"},{"$f":"+IFERROR(VLOOKUP(D8,'[1]Soporte Impacto'!$A:$V,22,FALSE),\"\")","v":"Mayor"},{"$f":"+IFERROR(VLOOKUP(G8&H8,'[1]Listas desplegables'!$CN$3:$CO$17,2,FALSE),\"\")","v":"Alta"}]
{"$rows_left_out":119}