{"text_format":"1","workbook":"xlsx","n_sheets":5,"sheets":["PLANTILLA","IMPORTANTE","Tipo y subtipo cotizantes","Subsistemas x Tipo de Pago","TABLAS"],"not_rendered":{"charts":0,"images":8,"macros":1,"external_links":0,"defined_names":48,"comments":0,"pivot_tables":0},"unopened":[],"bounds":{"document_bytes":16777216,"sheet_cells":100000,"rows_first":2000,"rows_last":500,"rows_between":2000,"halvings":0,"cell_chars":16384,"cell_head_chars":4096},"cells_cut":0,"cells_raw":0,"read":"whole","date_system":"1900"}

{"sheet":"PLANTILLA","index":0,"n_rows":8,"n_cols":70,"rows_kept":8,"cut":false,"hidden":false,"merged":[[5,1,5,13],[5,14,5,15],[5,17,5,21],[5,22,5,29],[1,23,3,23],[1,24,3,24],[1,25,3,25],[1,27,3,27]]}
[null,"Version 23.0",null,null,{"$f":"IF(E5=1,\"PUBLICA\",\"\")","v":""},null,null,null,null,null,null,null,null,null,null,null,null,null,null,null,null,null,null,null,null,null,null,null,null,null,null,null,null,null,null,null,null,null,null,null,null,null,null,null,null,null,null,null,null,null,null,null,null,null,null,null,null,null,null,null,null,null,null,null,null,null,null,null,".",{"$f":"IFERROR(VLOOKUP(BR3,TABLAS!$AA$4:$AB$110,2,0),IF($A$1=\"UGPP\",\"¿NATURALEZA JURIDICA Y TIPO DE APORTANTE?\",\".\"))","v":"."}]
[null,null,null,null,null,null,null,null,null,null,null,null,null,null,null,null,null,null,null,null,null,null,null,{"$f":"IF(F5=2,\"\", IF(AND(SUM(X8:X970024)>0,IFERROR(HLOOKUP(\"TP INCAPACIDAD\",$BR$3:$XFD$3,1,0),1)=1),\"Recuerde ingresar la columna con  TIPO DE PAGO Incapacidades y registrar los valores por este concepto\",\"\"))","v":""},{"$f":"IF(F5=2,\"\", IF(AND(SUM(Y8:Y970024)>0,IFERROR(HLOOKUP(\"TP INCAPACIDAD\",$BR$3:$XFD$3,1,0),1)=1),\"Recuerde ingresar la columna con  TIPO DE PAGO Incapacidades y registrar los valores por este concepto\",\"\"))","v":""},{"$f":"IF(AND(SUM(Z8:Z970024)>0,IFERROR(HLOOKUP(\"TP LICENCIA REMUNERADA\",$BR$3:$XFD$3,1,0),1)=1),\"Recuerde ingresar la columna con  TIPO DE PAGO Permiso o licencia remunerada y registrar los valores por este concepto\",\"\")","v":""},null,{"$f":"IF(AND(SUM(AB8:AB970024)>0,IFERROR(HLOOKUP(\"TP VACACIONES\",$BR$3:$XFD$3,1,0),1)=1),\"Recuerde ingresar la columna con  TIPO DE PAGO Vacaciones y registrar los valores por este concepto\",\"\")","v":""},null,null,null,null,null,null,null,null,null,null,null,null,null,null,null,null,null,null,null,null,null,null,null,null,null,null,null,null,null,null,null,null,null,null,null,null,null,null,null,null,"CAMPO RESERVADO PARA LA UGPP"]
[null,null,null,null,{"$f":"IF(E5=1,\"Publica\",\"No Publica\")","v":"No Publica"},{"$f":"IFERROR(VLOOKUP(E5&F5,TABLAS!R4:S42,2,0),\"\")","v":""},null,null,null,null,null,null,null,null,null,null,null,null,null,null,null,null,null,null,null,null,null,null,null,null,null,null,null,null,null,null,null,null,null,null,null,null,null,null,null,null,null,null,null,null,null,null,null,null,null,null,null,null,null,null,null,null,null,null,null,null,null,null,"TIPO DE PAGO"]
[null,"TIPO DOCUMENTO APORTANTE","NUMERO DOCUMENTO APORTANTE","RAZON SOCIAL","NATURALEZA JURIDICA","TIPO DE APORTANTE","CAMPO RESERVADO PARA LA UGPP","SUJETO PASIVO DEL IMPUESTO SOBRE LA RENTA PARA LA EQUIDAD CREE","CAMPO RESERVADO PARA LA UGPP","CAMPO RESERVADO PARA LA UGPP","CAMPO RESERVADO PARA LA UGPP","CAMPO RESERVADO PARA LA UGPP","CAMPO RESERVADO PARA LA UGPP","CAMPO RESERVADO PARA LA UGPP","CAMPO RESERVADO PARA LA UGPP","CAMPO RESERVADO PARA LA UGPP",null,null,null,null,null,null,null,null,null,null,null,null,null,null,null,null,null,null,null,null,null,null,null,null,null,null,null,null,null,null,null,null,null,null,null,null,null,null,null,null,null,null,null,null,null,null,null,null,null,null,null,null,"CAMPO RESERVADO PARA LA UGPP"]
[null,null,null,null,null,null,null,null,null,null,null,null,null,null,null,null,null,null,null,null,null,null,null,null,null,null,null,null,null,null,null,null,null,null,null,null,null,null,null,null,null,null,null,null,null,null,null,null,null,null,null,null,null,null,null,null,null,null,null,null,null,null,null,null,null,null,null,null,"CAMPO RESERVADO PARA LA UGPP",{"$f":"IF($A$1=\"UGPP\",IFERROR(VLOOKUP(BR3,TABLAS!$AA$4:$AC$110,3,0),IF($A$1=\"UGPP\",\"¿TIPO DE PAGO?\",\"\")), \"\")","v":""}]
[null,"Datos básicos del trabajador o asociado",null,null,null,null,null,null,null,null,null,null,null,null,"Periodo nómina",null,null,"Novedades",null,null,null,null,"Reporte de días",null,null,null,null,null,null,null,null,null,null,null,null,null,null,null,null,null,null,null,null,null,null,null,null,null,null,null,null,null,null,null,null,null,null,null,null,null,null,null,null,null,null,null,null,null,"cuenta contable"]
["ORDEN","TIPO COTIZANTE","SUBTIPO COTIZANTE","CONDICION ESPECIAL EMPRESA","CAMPO RESERVADO PARA LA UGPP","EXTRANJERO NO OBLIGADO A COTIZAR PENSION","COLOMBIANO EN EL EXTERIOR","ACTIVIDAD ALTO RIESGO PENSION","TIPO DOCUMENTO ACTUAL DEL COTIZANTE","NUMERO DOCUMENTO ACTUAL DEL COTIZANTE","TIPO DOCUMENTO CON EL QUE REALIZO APORTES DEL COTIZANTE","NUMERO DOCUMENTO CON EL QUE REALIZO APORTES DEL COTIZANTE","NOMBRE COTIZANTE","CARGO DEL TRABAJADOR O ASOCIADO","ANIO","MES","SALARIO INTEGRAL","NOVEDAD INCAPACIDAD","NOVEDAD LIC.MATERNIDAD O PATERNIDAD","NOVEDAD DE PERMISO O LICENCIA REMUNERADA","NOVEDAD DE SUSPENSION","NOVEDAD VACACIONES","NUMERO DIAS TRABAJADOS EN EL MES","NUMERO DIAS INCAPACIDADES EN EL MES","NUMERO DIAS LICENCIA DE MATERNIDAD O PATERNIDAD","NUMERO DIAS DE PERMISO O LICENCIA  REMUNERADAS EN EL MES","NUMERO DIAS DE SUSPENSION, PERMISO O LICENCIA  NO REMUNERADAS EN EL MES","NUMERO DE DIAS VACACIONES DISFRUTADAS EN EL MES O DESCANSO ANUAL REMUNERADO","NUMERO DIAS DE HUELGA LEGALMENTE DECLARADA","TOTAL DIAS REPORTADOS EN EL MES","INGRESO","FECHA ING","RETIRO","FECHA RET","FECHA DE INICIO DE VACACIONES","FECHA TERMINACION DE VACACIONES","FECHA INICIO PERMISO O LICENCIA REMUNERADA","FECHA INICIO SUSPENSION, PERMISO O LICENCIA NO REMUNERADA","FECHA INICIO HUELGA LEGALMENTE DECLARADA","CAMPO RESERVADO PARA LA UGPP","CAMPO RESERVADO PARA LA UGPP","CAMPO RESERVADO PARA LA UGPP","CAMPO RESERVADO PARA LA UGPP","CAMPO RESERVADO PARA LA UGPP","CAMPO RESERVADO PARA LA UGPP","OBSERVACIONES APORTANTE","CAMPO RESERVADO PARA LA UGPP","CAMPO RESERVADO PARA LA UGPP","CAMPO RESERVADO PARA LA UGPP","CAMPO RESERVADO PARA LA UGPP","CAMPO RESERVADO PARA LA UGPP","CAMPO RESERVADO PARA LA UGPP","CAMPO RESERVADO PARA LA UGPP","CAMPO RESERVADO PARA LA UGPP","CAMPO RESERVADO PARA LA UGPP","CAMPO RESERVADO PARA LA UGPP","CAMPO RESERVADO PARA LA UGPP","CAMPO RESERVADO PARA LA UGPP","CAMPO RESERVADO PARA LA UGPP","CAMPO RESERVADO PARA LA UGPP","CAMPO RESERVADO PARA LA UGPP","CAMPO RESERVADO PARA LA UGPP","CAMPO RESERVADO PARA LA UGPP","CAMPO RESERVADO PARA LA UGPP","CAMPO RESERVADO PARA LA UGPP","CAMPO RESERVADO PARA LA UGPP","CAMPO RESERVADO PARA LA UGPP","CAMPO RESERVADO PARA LA UGPP","NOMBRE CONCEPTO DE PAGO APORTANTE"]
[1,null,0,null,null,null,null,null,null,null,null,null,null,null,null,null,null,{"$f":"IF(X8>0,\"X\",\"\")","v":""},{"$f":"IF(Y8>0,\"X\",\"\")","v":""},{"$f":"IF(Z8>0,\"X\",\"\")","v":""},{"$f":"IF((AA8+AC8)>0,\"X\",\"\")","v":""},{"$f":"IF(AB8>0,\"X\",\"\")","v":""},0,0,0,0,0,0,0,{"$f":"IF(SUM(W8:AC8)=0,0,IF(AND(SUM(W8:AC8)<30,AE8=\"\",AG8=\"\"),\"Ingreso o Retiro\",IF(SUM(W8:AC8)>30,\"Días mayores a 30\",IF(AND(AE8=\"X\",OR(YEAR(AF8)<>O8,MONTH(AF8)<>P8)),\"Fecha ing.incorrecta\",IF(AND(AG8=\"X\",OR(YEAR(AH8)<>O8,MONTH(AH8)<>P8)),\"Fecha Ret.incorrecta\",SUM(W8:AC8))))))","v":0},{"$f":"IF(AF8=\"\",\"\",\"X\")","v":""},null,{"$f":"IF(AH8=\"\",\"\",\"X\")","v":""}]

{"sheet":"IMPORTANTE","index":1,"n_rows":0,"n_cols":0,"rows_kept":0,"cut":false,"hidden":true,"merged":[]}

{"sheet":"Tipo y subtipo cotizantes","index":2,"n_rows":192,"n_cols":13,"rows_kept":192,"cut":false,"hidden":true,"merged":[[38,0,39,0],[38,1,39,1],[38,2,38,11],[2,0,2,9],[3,0,4,0],[3,1,4,1],[3,2,3,9],[37,0,37,11],[130,0,130,1],[162,0,162,1],[175,0,175,1],[184,0,184,1],[72,0,72,12],[73,0,74,0],[73,1,74,1],[73,2,73,12],[107,0,107,2],[121,0,121,1]]}
[]
[]
["Tabla 17. R10- Regla de validación – Tipo de Cotizante  Vs Subsistema al que aporta"]
["TIPO COTIZANTE","CODIGO","SUBSISTEMA"]
[null,null,"SALUD","PENSION","ALTO RIESGO","FSP","ARP","CCF","ICBF","SENA"]
["DEPENDIENTE",1,"X","X","X","X","X","X","X","X",null,null,{"$f":"B6&\". \"&A6","v":"1. DEPENDIENTE"}]
["SERVICIO DOMESTICO",2,"X","X","X","X","X","X",null,null,null,null,{"$f":"B7&\". \"&A7","v":"2. SERVICIO DOMESTICO"}]
["INDEPENDIENTE",3,"X","X","X","X",null,null,null,null,null,null,"3. INDEPENDIENTE"]
["MADRE COMUNITARIA",4,"X",null,null,null,null,null,null,null,null,null,"4. MADRE COMUNITARIA"]
["APRENDICES DEL SENA EN ETAPA LECTIVA",12,"X",null,null,null,null,null,null,null,null,null,"12. APRENDICES DEL SENA EN ETAPA LECTIVA"]
["DESEMPLEADO CON SUBSIDIO DE CAJA DE COMPENSACION FAMILIAR",15,"X",null,null,null,null,null,null,null,null,null,"15. DESEMPLEADO CON SUBSIDIO DE CAJA DE COMPENSACION FAMILIAR"]
["INDEPENDIENTE AGREMIADO O ASOCIADO",16,"X","X","X","X",null,null,null,null,null,null,"16. INDEPENDIENTE AGREMIADO O ASOCIADO"]
["FUNCIONARIOS PUBLICOS SIN TOPE MAXIMO DE IBC",18,"X","X","X","X","X","X","X","X",null,null,"18. FUNCIONARIOS PUBLICOS SIN TOPE MAXIMO DE IBC"]
["APRENDICES DEL SENA EN ETAPA PRODUCTIVA",19,"X",null,null,null,"X",null,null,null,null,null,"19. APRENDICES DEL SENA EN ETAPA PRODUCTIVA"]
["ESTUDIANTES (REGIMEN ESPECIAL LEY 789 DE 2002)",20,"X","X","X","X","X",null,null,null,null,null,"20. ESTUDIANTES (REGIMEN ESPECIAL LEY 789 DE 2002)"]
["ESTUDIANTES DE POSTGRADO EN SALUD",21,"X",null,null,null,"X",null,null,null,null,null,"21. ESTUDIANTES DE POSTGRADO EN SALUD"]
["PROFESOR DE ESTABLECIMIENTO PARTICULAR",22,"X","X","X","X","X","X","X","X",null,null,"22. PROFESOR DE ESTABLECIMIENTO PARTICULAR"]
["DEPENDIENTE ENTIDADES O UNIVERSIDADES PUBLICAS CON REGIMEN ESPECIAL EN SALUD",30,"X","X","X","X","X","X","X","X",null,null,"30. DEPENDIENTE ENTIDADES O UNIVERSIDADES PUBLICAS CON REGIMEN ESPECIAL EN SALUD"]
["COOPERADOS O PRECOOPERATIVAS DE TRABAJO ASOCIADO",31,"X","X","X","X","X","X","X","X",null,null,"31. COOPERADOS O PRECOOPERATIVAS DE TRABAJO ASOCIADO"]
["COTIZANTE MIEMBRO DE LA CARRERA DIPLOMATICA O CONSULAR DE UN PAIS EXTRANJERO O FUNCIONARIO DE ORGANISMO MULTILATERAL",32,null,null,null,null,null,null,null,null,null,null,"32. COTIZANTE MIEMBRO DE LA CARRERA DIPLOMATICA O CONSULAR DE UN PAIS EXTRANJERO O FUNCIONARIO DE ORGANISMO MULTILATERAL"]
{"$rows_left_out":173}
{"sheet":"Subsistemas x Tipo de Pago","index":3,"n_rows":20,"n_cols":13,"rows_kept":20,"cut":false,"hidden":true,"merged":[]}
[]
[]
[null,null,null,null,"SUBSISTEMAS"]
[null,"NATURALEZA JURIDICA","TIPO DE APORTANTE","TIPO DE PAGO UGPP","SALUD","PENSION","RIESGOS LABORALES","CAJA DE COMPENSACION","SENA","ICBF","NOMBRE CONCEPTO UGPP"]
[null,"1 Pública\n2 Privada\n3 Mixta\n4 Organismos multilaterales\n5 Entidades de derecho público no sometidas a la legislación colombiana","1 Empleador.\n2 Independiente.\n3 Entidades o Universidades Públicas con régimen especial en Salud.\n4 Agremiaciones o asociaciones.\n5 Cooperativas y Precooperativas de Trabajo Asociado\n6 Misiones diplomáticas, consulares o de organismos multilaterales no sometidos a la legislación colombiana.\n7 Organizaciones Administradoras del Programa de Hogares de Bienestar.\n8 Pagador de aportes de los concejales municipales o distritales.\n9 Pagador de aportes contrato sindical","TP SALARIAL",1,2,3,4,5,6,"SUELDOS\nAPOYO SOSTENIMIENTO\nCOMISIONES\nHORAS EXTRAS\nBONIFICACIONES\nPRIMAS\nVIATICOS\nAUXILIOS\nOTROS PAGOS",null,"1;2;3;4;5;6"]
[null,"2 Privada\n3 Mixta\n4 Organismos multilaterales\n5 Entidades de derecho público no sometidas a la legislación colombiana","1 Empleador.\n2 Independiente.\n3 Entidades o Universidades Públicas con régimen especial en Salud.\n4 Agremiaciones o asociaciones.\n5 Cooperativas y Precooperativas de Trabajo Asociado\n6 Misiones diplomáticas, consulares o de organismos multilaterales no sometidos a la legislación colombiana.\n7 Organizaciones Administradoras del Programa de Hogares de Bienestar.\n8 Pagador de aportes de los concejales municipales o distritales.\n9 Pagador de aportes contrato sindical","TP NO SALARIAL",null,null,null,null,null,null,"BONIFICACIONES\nPRIMAS\nVIATICOS\nAUXILIOS\nOTROS PAGOS"]
[null,"1 Pública\n2 Privada\n3 Mixta\n4 Organismos multilaterales\n5 Entidades de derecho público no sometidas a la legislación colombiana","1 Empleador.\n2 Independiente.\n3 Entidades o Universidades Públicas con régimen especial en Salud.\n4 Agremiaciones o asociaciones.\n5 Cooperativas y Precooperativas de Trabajo Asociado\n6 Misiones diplomáticas, consulares o de organismos multilaterales no sometidos a la legislación colombiana.\n7 Organizaciones Administradoras del Programa de Hogares de Bienestar.\n8 Pagador de aportes de los concejales municipales o distritales.\n9 Pagador de aportes contrato sindical","TP NO SALARIAL MARCADO SALARIAL POR LA UGPP",1,2,3,4,5,6,"BONIFICACIONES\nPRIMAS\nVIATICOS\nAUXILIOS\nOTROS PAGOS",null,"1;2;3;4;5;6"]
[null,"2 Privada\n","5 Cooperativas y Precooperativas de Trabajo Asociado","TP COMPENSACIÓN ORDINARIA",1,2,3,4,5,6,"COMP. ORDINARIA\n",null,"1;2;3;4;5;6"]
[null,"2 Privada\n","5 Cooperativas y Precooperativas de Trabajo Asociado","TP COMPENSACIÓN EXTRAORDINARIA",1,2,3,4,null,null,"COMP. EXTRAORDINARIA\n",null,"1;2;3;4"]
[null,"2 Privada\n","5 Cooperativas y Precooperativas de Trabajo Asociado","TP NO COMPENSACIÓN",null,null,null,null,null,null,"BONIFICACIONES\nPRIMAS\nVIATICOS\nAUXILIOS\nOTROS PAGOS"]
[null,"2 Privada\n","5 Cooperativas y Precooperativas de Trabajo Asociado","TP NO COMPENSACIÓN MARCADA COMO COMP.EXTRAORDINARIA",1,2,3,4,null,null,"BONIFICACIONES\nPRIMAS\nVIATICOS\nAUXILIOS\nOTROS PAGOS",null,"1;2;3;4"]
[null,"1 Pública\n2 Privada\n3 Mixta\n4 Organismos multilaterales\n5 Entidades de derecho público no sometidas a la legislación colombiana","1 Empleador.\n2 Independiente.\n3 Entidades o Universidades Públicas con régimen especial en Salud.\n4 Agremiaciones o asociaciones.\n5 Cooperativas y Precooperativas de Trabajo Asociado\n6 Misiones diplomáticas, consulares o de organismos multilaterales no sometidos a la legislación colombiana.\n7 Organizaciones Administradoras del Programa de Hogares de Bienestar.\n8 Pagador de aportes de los concejales municipales o distritales.\n9 Pagador de aportes contrato sindical","TP INCAPACIDAD",1,2,null,null,null,null,"INCAPACIDADES\n",null,"1;2"]
[null,"1 Pública\n2 Privada\n3 Mixta\n4 Organismos multilaterales\n5 Entidades de derecho público no sometidas a la legislación colombiana","1 Empleador.\n2 Independiente.\n3 Entidades o Universidades Públicas con régimen especial en Salud.\n4 Agremiaciones o asociaciones.\n5 Cooperativas y Precooperativas de Trabajo Asociado\n6 Misiones diplomáticas, consulares o de organismos multilaterales no sometidos a la legislación colombiana.\n7 Organizaciones Administradoras del Programa de Hogares de Bienestar.\n8 Pagador de aportes de los concejales municipales o distritales.\n9 Pagador de aportes contrato sindical","TP VACACIONES",null,null,null,4,5,6,"VACACIONES\n",null,"4;5;6"]
[null,"1 Pública\n2 Privada\n3 Mixta\n4 Organismos multilaterales\n5 Entidades de derecho público no sometidas a la legislación colombiana","1 Empleador.\n2 Independiente.\n3 Entidades o Universidades Públicas con régimen especial en Salud.\n4 Agremiaciones o asociaciones.\n5 Cooperativas y Precooperativas de Trabajo Asociado\n6 Misiones diplomáticas, consulares o de organismos multilaterales no sometidos a la legislación colombiana.\n7 Organizaciones Administradoras del Programa de Hogares de Bienestar.\n8 Pagador de aportes de los concejales municipales o distritales.\n9 Pagador de aportes contrato sindical","TP VACACIONES TERMINACION DE CONTRATO",null,null,null,4,5,6,"VACACIONES TERMINACION DE CONTRATO",null,"4;5;6"]
[null,"1 Pública\n2 Privada\n3 Mixta\n4 Organismos multilaterales\n5 Entidades de derecho público no sometidas a la legislación colombiana","1 Empleador.\n2 Independiente.\n3 Entidades o Universidades Públicas con régimen especial en Salud.\n4 Agremiaciones o asociaciones.\n5 Cooperativas y Precooperativas de Trabajo Asociado\n6 Misiones diplomáticas, consulares o de organismos multilaterales no sometidos a la legislación colombiana.\n7 Organizaciones Administradoras del Programa de Hogares de Bienestar.\n8 Pagador de aportes de los concejales municipales o distritales.\n9 Pagador de aportes contrato sindical","TP LICENCIA REMUNERADA",null,null,null,null,null,null,"LICENCIA REMUNERADA"]
[null,"1 Pública\n","1 Empleador.\n3 Entidades o Universidades Públicas con régimen especial en Salud.\n6 Misiones diplomáticas, consulares o de organismos multilaterales no sometidos a la legislación colombiana.\n7 Organizaciones Administradoras del Programa de Hogares de Bienestar.\n8 Pagador de aportes de los concejales municipales o distritales.\n9 Pagador de aportes contrato sindical","TP NO SALARIAL PUBLICA",null,null,null,null,null,null,"BONIFICACIONES\nPRIMAS\nVIATICOS\nAUXILIOS\nOTROS PAGOS"]
[null,"1 Pública\n","1 Empleador.\n3 Entidades o Universidades Públicas con régimen especial en Salud.\n6 Misiones diplomáticas, consulares o de organismos multilaterales no sometidos a la legislación colombiana.\n7 Organizaciones Administradoras del Programa de Hogares de Bienestar.\n8 Pagador de aportes de los concejales municipales o distritales.\n9 Pagador de aportes contrato sindical","TP NO SALARIAL PUBLICA NO ACEPTADO UGPP","NO VALIDAR","NO VALIDAR","NO VALIDAR","NO VALIDAR","NO VALIDAR","NO VALIDAR","BONIFICACIONES\nPRIMAS\nVIATICOS\nAUXILIOS\nOTROS PAGOS"]
[null,"2 Privada","2 Independiente.","TP CONTRATISTA",1,2,3,null,null,null,"SUELDOS",null,"1;2;3"]
[null,"2 Privada","2 Independiente.","TP NO CONTRATISTA",1,2,null,null,null,null,"SUELDOS",null,"1;2"]
[null,"1 Pública\n2 Privada\n3 Mixta\n4 Organismos multilaterales\n5 Entidades de derecho público no sometidas a la legislación colombiana","1 Empleador.\n3 Entidades o Universidades Públicas con régimen especial en Salud.\n4 Agremiaciones o asociaciones.\n5 Cooperativas y Precooperativas de Trabajo Asociado\n6 Misiones diplomáticas, consulares o de organismos multilaterales no sometidos a la legislación colombiana.\n7 Organizaciones Administradoras del Programa de Hogares de Bienestar.\n8 Pagador de aportes de los concejales municipales o distritales.","TP PRESTACIONES",null,null,null,null,null,null,"CESANTIAS\nINTERESES DE CESANTIAS\nPRIMAS"]
{"$rows_left_out":1}
{"sheet":"TABLAS","index":4,"n_rows":166,"n_cols":33,"rows_kept":166,"cut":false,"hidden":true,"merged":[]}
[]
[]
[]
["TIPO DOCUMENTO APORTANTE","NATURALEZA JURIDICA","TIPO DE APORTANTE","APORTA ESAP Y MEN","SUJETO PASIVO DEL IMPUESTO SOBRE LA RENTA PARA LA EQUIDAD CREE","TIPO DE ACTO","TIPO COTIZANTE","SUBTIPO COTIZANTE","CONDICION ESPECIAL EMPRESA","EXTRANJERO NO OBLIGADO A COTIZAR PENSION","COLOMBIANO EN EL EXTERIOR","ACTIVIDAD ALTO RIESGO PENSION","TIPO DOCUMENTO ACTUAL DEL COTIZANTE","AÑO","MES","SALARIO INTEGRAL",null,"LLAVE","GRUPO",null,"NATURALEZA JURIDICA","TIPO DE APORTANTE","LLAVE","GRUPO","TIPO DE PAGO UGPP",null,"TIPO DE PAGO UGPP","GRUPO TP","SUBSISTEMAS",null,"TIPO DE PAGO UGPP","GRUPO TP","NOMBRE CONCEPTO UGPP"]
[null,null,null,null,null,null,null,null,null,null,null,null,null,null,null,null,null,"11","PublicaEmp",null,"1 Pública","1 Empleador.",11,"PublicaEmp","TP SALARIAL","Y5","TP SALARIAL","SAL","1;2;3;4;5;6",null,"TP SALARIAL","SAL","SUELDOS"]
["CC",1,1,"X","SI","REQUERIMIENTO",1,0,"LEY 590/2000 AÑO 1","X","X","X","CC",2007,1,"X",null,"13","PublicaUniv",null,"1 Pública","1 Empleador.",11,"PublicaEmp","TP A ESTUDIANTES O APRENDICES","Y6","TP NO SALARIAL MARCADO SALARIAL POR LA UGPP","NOSALX","1;2;3;4;5;6",null,"TP SALARIAL","SAL","COMISIONES"]
["CE",2,null,null,"NO","AMPLIACIÓN",2,1,"LEY 590/2000 AÑO 2",null,null,null,"CE",2008,2,null,null,"18","PublicaConc",null,"1 Pública","1 Empleador.",11,"PublicaEmp","TP INCAPACIDAD","Y7","TP COMPENSACIÓN ORDINARIA","COMPORD","1;2;3;4;5;6",null,"TP SALARIAL","SAL","HORAS EXTRAS"]
["TI",3,3,null,null,"LIQUIDACIÓN",3,2,"LEY 590/2000 AÑO 3",null,null,null,"TI",2009,3,null,null,"19","PublicaSind",null,"1 Pública","1 Empleador.",11,"PublicaEmp","TP VACACIONES","Y8","TP COMPENSACIÓN EXTRAORDINARIA","COMPEXT","1;2;3;4",null,"TP SALARIAL","SAL","BONIFICACIONES"]
["PA",4,4,null,null,"RECURSO",4,3,"LEY 1429 Col AÑO 1,2",null,null,null,"PA",2010,4,null,null,"21","PrivadaEmp",null,"1 Pública","1 Empleador.",11,"PublicaEmp","TP VACACIONES TERMINACION DE CONTRATO","Y9","TP NO COMPENSACIÓN MARCADA COMO COMP.EXTRAORDINARIA","NOCOMPX","1;2;3;4",null,"TP SALARIAL","SAL","PRIMAS"]
["NI",5,5,null,null,null,12,4,"LEY 1429 Col AÑO 3",null,null,null,"NI",2011,5,null,null,"22","PrivadaInd",null,"1 Pública","1 Empleador.",11,"PublicaEmp","TP LICENCIA REMUNERADA","Y10","TP DESCANSO ANUAL","DEA","1;2;4",null,"TP SALARIAL","SAL","VIATICOS"]
[null,null,6,null,null,null,15,5,"LEY 1429 Col AÑO 4",null,null,null,null,2012,6,null,null,"24","PrivadaAgrem",null,"1 Pública","1 Empleador.",11,"PublicaEmp","TP NO SALARIAL","Y11","TP INCAPACIDAD","INCAP","1;2",null,"TP SALARIAL","SAL","AUXILIOS"]
[null,null,7,null,null,null,16,6,"LEY 1429 Col AÑO 5",null,null,null,null,2013,7,null,null,"25","PrivadaCTA",null,"1 Pública","1 Empleador.",11,"PublicaEmp","TP PRESTACIONES","Y12","TP VACACIONES","VACA","4;5;6",null,"TP SALARIAL","SAL","OTROS PAGOS"]
[null,null,8,null,null,null,18,9,"LEY 1429 AGV AÑO 1 - 8",null,null,null,null,2014,8,null,null,"27","PrivadaHorg","TP NO SALARIAL PACTADO","1 Pública","1 Empleador.",11,"PublicaEmp",null,"Y13","TP CONTRATISTA","CONTRA","1;2",null,"TP NO SALARIAL","NOSAL","BONIFICACIONES"]
[null,null,9,null,null,null,19,10,"LEY 1429 AGV AÑO 9",null,null,null,null,2015,9,null,null,"29","PrivadaSind","TP MERA LIBERALIDAD HABITUAL","1 Pública","1 Empleador.",11,"PublicaEmp",null,"Y14","TP NO CONTRATISTA","NOCONTRA","1;2",null,"TP NO SALARIAL","NOSAL","PRIMAS"]
[null,null,null,null,null,null,20,11,"LEY 1429 AGV AÑO 10",null,null,null,null,2016,10,null,null,"31","MixtaEmp","TP MERA LIBERALIDAD OCASIONAL","1 Pública","1 Empleador.",11,"PublicaEmp",null,"Y15","TP PRESTACIONES","PRESTAC",null,null,"TP NO SALARIAL","NOSAL","VIATICOS"]
[null,null,null,null,null,null,21,12,"Soc.declaradas Zona Franca",null,null,null,null,2017,11,null,null,"39","MixtaSind",null,"1 Pública","3 Entidades o Universidades Públicas con régimen especial en Salud.",13,"PublicaUniv","TP SALARIAL","Y16","TP NO SALARIAL","NOSAL",null,null,"TP NO SALARIAL","NOSAL","AUXILIOS"]
[null,null,null,null,null,null,22,null,"Excepción SENA Art.181,Ley 223/95",null,null,null,null,2018,12,null,null,"46","OrgMisionD",null,"1 Pública","3 Entidades o Universidades Públicas con régimen especial en Salud.",13,"PublicaUniv","TP A ESTUDIANTES O APRENDICES","Y17","TP NO COMPENSACIÓN","NOCOMP",null,null,"TP NO SALARIAL","NOSAL","OTROS PAGOS"]
[null,null,null,null,null,null,23,null,"Conv.Sub.Fam.Art.17Ley 344/96",null,null,null,null,2019,null,null,null,"56","EntMisionD",null,"1 Pública","3 Entidades o Universidades Públicas con régimen especial en Salud.",13,"PublicaUniv","TP INCAPACIDAD","Y18","TP LICENCIA REMUNERADA","LICREM",null,null,"TP NO SALARIAL MARCADO SALARIAL POR LA UGPP","NOSALX","BONIFICACIONES"]
[null,null,null,null,null,null,30,null,null,null,null,null,null,2020,null,null,null,null,null,null,"1 Pública","3 Entidades o Universidades Públicas con régimen especial en Salud.",13,"PublicaUniv","TP VACACIONES","Y19","TP NO SALARIAL PUBLICA","NOSALPUB",null,null,"TP NO SALARIAL MARCADO SALARIAL POR LA UGPP","NOSALX","PRIMAS"]
[null,null,null,null,null,null,31,null,null,null,null,null,null,2021,null,null,null,null,null,null,"1 Pública","3 Entidades o Universidades Públicas con régimen especial en Salud.",13,"PublicaUniv","TP VACACIONES TERMINACION DE CONTRATO","Y20","TP NO SALARIAL PUBLICA NO ACEPTADO UGPP","NOSALPUBX",null,null,"TP NO SALARIAL MARCADO SALARIAL POR LA UGPP","NOSALX","VIATICOS"]
{"$rows_left_out":146}